{"text_format":"1","workbook":"xlsx","n_sheets":12,"sheets":["入力用","個人サイズ表","調査票（上衣）","調査票(ズボン）","サイズ表(着丈）","サイズ表(肩幅）","サイズ表(身幅）","サイズ表(袖丈）","サイズ表(ウェスト）","サイズ表(総丈）","サイズ表(股下）","名前管理"],"not_rendered":{"charts":0,"images":7,"macros":1,"external_links":0,"defined_names":9,"comments":0,"pivot_tables":0},"unopened":[],"bounds":{"document_bytes":16777216,"sheet_cells":100000,"rows_first":2000,"rows_last":500,"rows_between":2000,"halvings":0,"cell_chars":16384,"cell_head_chars":4096},"cells_cut":0,"cells_raw":0,"read":"whole","date_system":"1900"}

{"sheet":"入力用","index":0,"n_rows":72,"n_cols":31,"rows_kept":72,"cut":false,"hidden":false,"merged":[[51,14,51,21],[47,16,47,21],[43,20,43,21],[44,16,44,21],[45,16,45,21],[46,14,46,23],[48,14,48,21],[49,14,49,15],[49,16,49,21],[47,14,47,15],[45,14,45,15],[44,14,44,15],[50,14,50,21],[43,14,43,15],[43,17,43,18],[9,2,9,3],[9,4,9,5],[9,6,9,7],[9,8,9,9],[28,0,28,1],[1,0,1,25],[7,4,7,5],[7,6,7,7],[7,8,7,9],[7,10,7,11],[7,12,7,13],[7,14,7,15],[7,16,7,17],[7,18,7,19],[7,20,7,21],[7,2,8,3],[8,12,8,13],[8,14,8,15],[4,2,4,21],[8,16,8,17],[8,4,8,5],[9,22,9,23],[8,20,8,21],[8,18,8,19],[9,24,9,25],[7,22,8,26],[9,20,9,21],[9,18,9,19],[9,10,9,11],[40,17,40,20],[41,18,41,20],[5,6,5,17],[9,16,9,17],[28,13,28,14],[8,6,8,7],[8,8,8,9],[8,10,8,11],[9,12,9,13],[9,14,9,15],[36,17,36,21],[39,17,39,21],[49,25,49,26],[40,23,41,33],[36,14,36,16],[37,14,38,16],[39,14,39,16],[37,23,38,26],[41,14,41,17],[39,23,39,28],[40,14,40,16],[45,27,45,29],[43,25,43,26],[44,25,44,26],[45,25,45,26],[47,25,47,26]]}
[]
["消防礼服サイズ入力画面(個人用）"]
[]
[]
[null,null,"入力表に、計測されたご自身のサイズを５㎜単位でお入れください。　　　　  　　　　　　　　　　　　　　　　　　　　　　　　　　　　　　　　　　（消防礼服サイズガイドを参考にして数字のみを入力してください）"]
[null,null,null,null,null,null,"（礼服のサイズ選びは、入力表の着丈、肩幅と股下を優先して選んでください。）"]
[]
[null,null,"入力表",null,"身長",null,"体重",null,"着丈",null,"肩幅",null,"身幅",null,"袖丈",null,"ウェスト",null,"総丈",null,"股下"]
[]
[]
[]
[]
[]
[]
[]
[]
[]
[]
[]
[]
[]
[]
[]
[]
[]
[]
[]
[]
[]
[]
[]
[]
[]
[]
[]
[]
[null,null,null,null,null,null,null,null,null,null,null,null,null,null,"ご希望の色"]
[null,null,null,null,null,null,null,null,null,null,null,null,null,null,"ご希望のサイズ　　　　(２着まで試着可能）",null,null,"上衣",null,null,null,null,null,null,null,null,null,false,{"$f":"IF(AB38=TRUE,\"紺色\",\"\")","v":""}]
[null,null,null,null,null,null,null,null,null,null,null,null,null,null,null,null,null,"ズボン",null,null,null,null,null,null,null,null,null,true,{"$f":"IF(AB39=TRUE,\"黒色\",\"\")","v":"黒色"}]
[null,null,null,null,null,null,null,null,null,null,null,null,null,null,"ご希望のネクタイ",null,null,null,null,null,null,null,null,null,null,null,null,null,null,false,{"$f":"IF(AD40=TRUE,\"白色\",\"\")","v":""}]
{"$rows_left_out":33}
{"sheet":"個人サイズ表","index":1,"n_rows":37,"n_cols":9,"rows_kept":37,"cut":false,"hidden":false,"merged":[[31,4,31,8],[32,4,32,8],[36,2,38,8],[31,2,31,3],[27,2,28,3],[29,2,29,3],[30,2,30,3],[32,2,32,3],[33,2,33,3],[34,2,34,3],[33,4,33,8],[34,4,34,8],[29,4,29,8],[30,4,30,8],[26,2,26,3],[26,4,26,8],[1,2,1,8],[5,6,5,7],[6,6,6,7],[5,2,5,3],[6,2,6,3],[5,4,5,5],[2,3,3,7]]}
[]
[null,null,"消防礼服サイズ確認画面（出力用）"]
[null,null,null,null,null,null,null,null,"https://reserva.be/reihuku"]
[]
[]
[null,null,"消防本部名",null,"氏　　　名",null,"試着希望日"]
[null,null,{"$f":"入力用!Q45","v":0},null,{"$f":"入力用!R44","v":0},{"$f":"入力用!U44","v":0},{"$f":"入力用!Q46","v":"00:00:00"},{"$f":"入力用!W44","v":"00:00:00"}]
[]
[]
[]
[null,null,"上　衣"]
[]
[null,null,"身長","体重","タイプ","着丈","肩幅","身幅","袖丈"]
[null,null,{"$f":"'調査票（上衣）'!B2","v":0},{"$f":"'調査票（上衣）'!B3","v":0},{"$f":"'調査票（上衣）'!B6","v":""},{"$f":"'調査票（上衣）'!B18","v":""},{"$f":"'調査票（上衣）'!B22","v":""},{"$f":"'調査票（上衣）'!B26","v":""},{"$f":"'調査票（上衣）'!B30","v":""}]
[]
[]
[]
[null,null,"ズボン"]
[]
[null,null,"身長","体重","タイプ","ウェスト","総丈","股下"]
[null,null,{"$f":"'調査票(ズボン）'!B2","v":0},{"$f":"'調査票(ズボン）'!B3","v":0},{"$f":"'調査票(ズボン）'!B6","v":""},{"$f":"'調査票(ズボン）'!B18","v":""},{"$f":"'調査票(ズボン）'!B22","v":""},{"$f":"'調査票(ズボン）'!B26","v":""}]
[]
[]
[]
[]
[]
[null,null,"ご希望の色",null,{"$f":"入力用!R37","v":0}]
[null,null,"ご希望のサイズ",null,"上衣",{"$f":"入力用!S38","v":0},{"$f":"入力用!T38","v":0},{"$f":"入力用!U38","v":0},{"$f":"入力用!V38","v":0}]
[null,null,null,null,"ズボン",{"$f":"入力用!S39","v":0},{"$f":"入力用!T39","v":0},{"$f":"入力用!U39","v":0},{"$f":"入力用!V39","v":0}]
[null,null,"ご希望のネクタイ",null,{"$f":"入力用!R40","v":0}]
[null,null,"帽子サイズ",null,{"$f":"入力用!R41","v":0}]
[null,null,"靴サイズ（白色のみ）",null,{"$f":"入力用!S42","v":0}]
[null,null,"返信用アドレス",null,{"$f":"入力用!Q48","v":0}]
[null,null,"ご使用のアドレス",null,{"$f":"入力用!Q50","v":0}]
[null,null,"親睦会（大阪市消防局）",null,{"$f":"入力用!AB51","v":""}]
[]
[null,null,"この画面には入力しないでください（自動で入力されます）"]

{"sheet":"調査票（上衣）","index":2,"n_rows":41,"n_cols":16,"rows_kept":41,"cut":false,"hidden":true,"merged":[[11,10,11,11],[12,10,12,11],[11,2,11,3],[11,4,11,5],[11,6,11,7],[11,8,11,9],[12,2,12,3],[12,4,12,5],[12,6,12,7],[12,8,12,9]]}
[]
["身長",{"$f":"入力用!E9","v":0},"cm",null,null,null,null,"指数",null,"タイプ"]
["体重",{"$f":"入力用!G9","v":0},"kg",null,null,null,null,0.1,0.28999999999999998,"Y"]
["指数",{"$f":"IFERROR(B3/B2,\"\")","v":""},null,null,null,null,null,0.33400000000000002,0.34999000000000002,"A"]
[null,null,null,null,null,null,null,0.39989999999999998,0.42998999999999998,"AB"]
["体形",{"$f":"IFERROR(VLOOKUP(B4,H3:J9,3,TRUE),\"\")","v":""},null,null,null,null,null,0.46,0.49998999999999999,"B"]
[null,null,null,null,null,null,null,0.5,0.7,"O"]
[null,null,null,null,null,null,null,150,185.9,"普"]
[null,null,null,null,null,null,null,185,210,"特"]
[]
[]
[null,null,"体形",null,"着丈",null,"肩幅",null,"身幅",null,"袖丈",null,null,null,"身長","体重"]
[null,null,{"$f":"B6","v":""},null,{"$f":"B18","v":""},null,{"$f":"B22","v":""},null,{"$f":"B26","v":""},null,{"$f":"B30","v":""},null,null,null,{"$f":"B2","v":0},{"$f":"B3","v":0}]
[]
[]
["着丈",{"$f":"入力用!I9","v":0},"着丈","上限",null,"肩幅","上限",null,"身幅","上限",null,"袖丈","上限"]
[null,"cm",70,71.900000000000006,"Y-４",44,44.9,"Y-４",46,46.9,"Y-４",56.5,57.9,"Y-４"]
["サイズ",{"$f":"IFERROR(INDEX('サイズ表(着丈）'!$F$8:$L$37,MATCH($B$16,'サイズ表(着丈）'!$E$8:$E$37,0),MATCH($B$6,'サイズ表(着丈）'!$F$7:$L$7,0)),\"\")","v":""},72,73.900000000000006,"Y-５",45,45.9,"Y-５",47,47.9,"Y-５",58,59.4,"Y-５"]
[null,null,74,75.900000000000006,"Y-６",46,46.9,"Y-６",48,49.9,"Y-６",59.5,60.9,"Y-６"]
["肩幅",{"$f":"入力用!K9","v":0},76,77.900000000000006,"Y-７",47,47.9,"Y-７",50,51.9,"Y-７",61,62.4,"Y-７"]
[null,"cm",78,79.900000000000006,"Y-８",48,48.9,"Y-８",52,52.9,"Y-８",62.5,63.9,"Y-８"]
["サイズ",{"$f":"IFERROR(INDEX('サイズ表(肩幅）'!$F$8:$L$33,MATCH($B$20,'サイズ表(肩幅）'!$E$8:$E$33,0),MATCH($B$6,'サイズ表(肩幅）'!$F$7:$L$7,0)),\"\")","v":""},80,81.900000000000006,"Y-９",49,49.9,"Y-９",54,54.9,"Y-９",64,65.400000000000006,"Y-９"]
[null,null,82,84,"Y-１０",50,50.9,"Y-１０",55,55.9,"Y-１０",65.5,66.900000000000006,"Y-１０"]
["身幅",{"$f":"入力用!M9","v":0},72,73.900000000000006,"A-５",46,46.9,"A-５",48,49.9,"A-５",58,59.4,"A-５"]
[null,"cm",74,75.900000000000006,"A-６",47,47.9,"A-６",50,51.9,"A-６",59.5,60.9,"A-６"]
["サイズ",{"$f":"IFERROR(INDEX('サイズ表(身幅）'!$F$8:$L$40,MATCH($B$24,'サイズ表(身幅）'!$E$8:$E$40,0),MATCH($B$6,'サイズ表(身幅）'!$F$7:$L$7,0)),\"\")","v":""},76,77.900000000000006,"A-７",48,48.9,"A-７",52,52.9,"A-７",61,62.4,"A-７"]
[null,null,78,79.900000000000006,"A-８",49,49.9,"A-８",53,54.9,"A-８",62.5,63.9,"A-８"]
["袖丈",{"$f":"入力用!O9","v":0},80,81.900000000000006,"A-９",50,50.9,"A-９",55,55.9,"A-９",64,65.400000000000006,"A-９"]
[null,"cm",72,73.900000000000006,"AB-５",47.5,48.9,"AB-５",52,53.9,"AB-５",58,59.4,"AB-５"]
["サイズ",{"$f":"IFERROR(INDEX('サイズ表(袖丈）'!$F$8:$L$30,MATCH($B$28,'サイズ表(袖丈）'!$E$8:$E$30,0),MATCH($B$6,'サイズ表(袖丈）'!$F$7:$L$7,0)),\"\")","v":""},74,75.900000000000006,"AB-６",49,49.9,"AB-６",54,55.9,"AB-６",59.5,60.9,"AB-６"]
[null,null,76,77.900000000000006,"AB-７",50,50.9,"AB-７",56,57.9,"AB-７",61,62.4,"AB-７"]
[null,null,78,79.900000000000006,"AB-８",51,51.9,"AB-８",58,59.9,"AB-８",62.5,63.9,"AB-８"]
["体形",{"$f":"B6","v":""},80,81.900000000000006,"AB-９",52,52.9,"AB-９",60,60.9,"AB-９",64,65.400000000000006,"AB-９"]
["身長",{"$f":"B2","v":0},82,85,"AB-１０",53,55,"AB-１０",61,63,"AB-１０",65.5,66.900000000000006,"AB-１０"]
["体重",{"$f":"B3","v":0},72,73.900000000000006,"B-５",50,51.4,"B-５",54,55.9,"B-５",58,59.4,"B-５"]
[null,null,74,75.900000000000006,"B-６",51.5,52.9,"B-６",56,57.9,"B-６",59.5,60.9,"B-６"]
["指数",{"$f":"B4","v":""},76,77.900000000000006,"B-７",53,54.4,"B-７",58,59.9,"B-７",61,62.4,"B-７"]
[null,null,78,79.900000000000006,"B-８",54.5,56,"B-８",60,60.9,"B-８",62.5,63.9,"B-８"]
[null,null,72,73.900000000000006,"O-５",51.5,52.9,"O-５",59,60.9,"O-５",58,59.4,"O-５"]
[null,null,74,77,"O-６",53,55.9,"O-６",61,63,"O-６",59.5,65.900000000000006,"O-６"]
{"$rows_left_out":2}
{"sheet":"調査票(ズボン）","index":3,"n_rows":55,"n_cols":28,"rows_kept":55,"cut":false,"hidden":true,"merged":[[11,2,11,3],[11,4,11,5],[11,6,11,7],[11,8,11,9],[12,8,12,9],[12,6,12,7],[12,4,12,5],[12,2,12,3]]}
[]
["身長",{"$f":"入力用!E9","v":0},"cm",null,null,null,null,"指数",null,"タイプ"]
["体重",{"$f":"入力用!G9","v":0},"kg",null,null,null,null,0.1,0.28999999999999998,"Y"]
["指数",{"$f":"B3/B2","v":{"$error":"#DIV/0!"}},null,null,null,null,null,0.33400000000000002,0.34999000000000002,"A"]
[null,null,null,null,null,null,null,0.39989999999999998,0.42998999999999998,"AB"]
["体形",{"$f":"IFERROR(VLOOKUP(B4,H3:J9,3,TRUE),\"\")","v":""},null,null,null,null,null,0.46,0.49998999999999999,"B"]
[null,null,null,null,null,null,null,0.5,0.7,"O"]
[null,null,null,null,null,null,null,150,185.9,"普"]
[null,null,null,null,null,null,null,185,210,"特"]
[]
[]
[null,null,"体形",null,"ウェスト",null,"総丈",null,"股下",null,null,"身長","体重"]
[null,null,{"$f":"B6","v":""},null,{"$f":"B18","v":""},null,{"$f":"B22","v":""},null,{"$f":"B26","v":""},null,null,{"$f":"B2","v":0},{"$f":"B3","v":0}]
[]
[]
["ウェスト",{"$f":"入力用!Q9","v":0},"ウェスト","上限",null,"総丈","上限",null,"股下","上限"]
[null,"cm",37,null,"Y-４",96,null,"Y-４",70,null,"Y-４"]
["サイズ",{"$f":"IFERROR(INDEX('サイズ表(ウェスト）'!$F$8:$L$38,MATCH($B$16,'サイズ表(ウェスト）'!$E$8:$E$38,0),MATCH($B$6,'サイズ表(ウェスト）'!$F$7:$L$7,0)),\"\")","v":""},38,null,"Y-５",98,null,"Y-５",72,null,"Y-５"]
[null,null,39,null,"Y-６",100,null,"Y-６",74,null,"Y-６"]
["総丈",{"$f":"入力用!S9","v":0},40,null,"Y-７",102,null,"Y-７",76,null,"Y-７"]
[null,"cm",41,null,"Y-８",105,null,"Y-８",78,null,"Y-８"]
["サイズ",{"$f":"IFERROR(INDEX('サイズ表(総丈）'!$F$8:$L$41,MATCH($B$20,'サイズ表(総丈）'!$E$8:$E$41,0),MATCH($B$6,'サイズ表(総丈）'!$F$7:$L$7,0)),\"\")","v":""},42,null,"Y-９",107,null,"Y-９",80,null,"Y-９"]
[null,null,43,null,"Y-１０",109,null,"Y-１０",82,null,"Y-１０"]
["股下",{"$f":"入力用!U9","v":0},40,null,"A-５",97,null,"A-５",71,null,"A-５"]
[null,"cm",41,null,"A-６",99,null,"A-６",73,null,"A-６"]
["サイズ",{"$f":"IFERROR(INDEX('サイズ表(股下）'!$F$8:$L$39,MATCH($B$24,'サイズ表(股下）'!$E$8:$E$39,0),MATCH($B$6,'サイズ表(股下）'!$F$7:$L$7,0)),\"\")","v":""},42,null,"A-７",102,null,"A-７",75,null,"A-７"]
[null,null,43,null,"A-８",104,null,"A-８",77,null,"A-８"]
[null,null,44,null,"A-９",106,null,"A-９",79,null,"A-９"]
[null,null,40,null,"AB-５",98,null,"AB-５",71,null,"AB-５"]
[null,null,42,null,"AB-６",100,null,"AB-６",73,null,"AB-６"]
[null,null,44,null,"AB-７",104,null,"AB-７",75,null,"AB-７"]
[null,null,46,null,"AB-８",105,null,"AB-８",77,null,"AB-８"]
["体形",{"$f":"B6","v":""},48,null,"AB-９",107,null,"AB-９",79,null,"AB-９"]
["身長",{"$f":"B2","v":0},50,null,"AB-１０",110,null,"AB-１０",81,null,"AB-１０"]
["体重",{"$f":"B3","v":0},47,null,"B-５",98,null,"B-５",70,null,"B-５"]
[null,null,48,null,"B-６",101,null,"B-６",72,null,"B-６"]
["指数",{"$f":"B4","v":{"$error":"#DIV/0!"}},49,null,"B-７",103,null,"B-７",74,null,"B-７"]
[null,null,50,null,"B-８",105,null,"B-８",78,null,"B-８"]
[null,null,50,null,"O-５",99,null,"O-５",69,null,"O-５"]
[null,null,51,null,"O-６",102,null,"O-６",71,null,"O-６"]
{"$rows_left_out":16}
{"sheet":"サイズ表(着丈）","index":4,"n_rows":37,"n_cols":12,"rows_kept":37,"cut":false,"hidden":true,"merged":[]}
[]
[]
[]
[null,null,null,null,"着　丈"]
[]
[]
[null,null,null,null,"着丈・サイズ","Y","A","AB","B","O","普","特"]
[null,null,null,null,69.5,"Y-４"]
[null,null,null,null,70,"Y-４"]
[null,null,null,null,70.5,"Y-４・Y-５","A-５"]
[null,null,null,null,71,"Y-４・Y-５","A-５","AB-５","B-５","O-５"]
[null,null,null,null,71.5,"Y-４・Y-５","A-５","AB-５","B-５","O-５"]
[null,null,null,null,72,"Y-５","A-５","AB-５","B-５","O-５"]
[null,null,null,null,72.5,"Y-５・Y-６","A-５・A-６","AB-５・AB-６","B-５・B-６","O-５・O-６"]
[null,null,null,null,73,"Y-５・Y-６","A-５・A-６","AB-５・AB-６","B-５・B-６","O-５・O-６"]
[null,null,null,null,73.5,"Y-５・Y-６","A-５・A-６","AB-６・AB-７","B-５・B-６","O-５・O-６"]
[null,null,null,null,74,"Y-６","A-６","AB-６","B-６","O-６"]
[null,null,null,null,74.5,"Y-６・Y-７","A-６・A-７","AB-６・AB-７","B-６・B-７","O-６"]
[null,null,null,null,75,"Y-６・Y-７","A-６・A-７","AB-６・AB-７","B-６・B-７","O-６"]
[null,null,null,null,75.5,"Y-６・Y-７","A-６・A-７","AB-６・AB-７","B-６・B-７"]
[null,null,null,null,76,"Y-７","A-７","AB-７","B-７"]
[null,null,null,null,76.5,"Y-７・Y-８","A-７・A-８","AB-７・AB-８","B-７・B-８"]
[null,null,null,null,77,"Y-７・Y-８","A-７・A-８","AB-７・AB-８","B-７・B-８"]
[null,null,null,null,77.5,"Y-７・Y-８","A-７・A-８","AB-７・AB-８","B-７・B-８"]
[null,null,null,null,78,"Y-８","A-８","AB-８","B-８"]
[null,null,null,null,78.5,"Y-８・Y-９","A-８・A-９","AB-８・AB-９","B-８"]
[null,null,null,null,79,"Y-８・Y-９","A-８・A-９","AB-８・AB-９","B-８"]
[null,null,null,null,79.5,"Y-８・Y-９","A-８・A-９","AB-８・AB-９"]
[null,null,null,null,80,"Y-９","A-９","AB-９"]
[null,null,null,null,80.5,"Y-９・Y-10","A-９","AB-９・AB-１０"]
[null,null,null,null,81,"Y-９・Y-10","A-９","AB-９・AB-１０"]
[null,null,null,null,81.5,"Y-９・Y-10",null,"AB-９・AB-１０"]
[null,null,null,null,82,"Y-１０",null,"AB-１０"]
[null,null,null,null,82.5,"Y-１０",null,"AB-１０"]
[null,null,null,null,83,"Y-１０",null,"AB-１０"]
[null,null,null,null,83.5,"Y-１０",null,"AB-１０"]
[null,null,null,null,84,"Y-１０",null,null,null,null,null,"特"]

{"sheet":"サイズ表(肩幅）","index":5,"n_rows":33,"n_cols":12,"rows_kept":33,"cut":false,"hidden":true,"merged":[]}
[]
[]
[]
[null,null,null,null,"肩　幅"]
[]
[]
[null,null,null,null,"着丈・サイズ","Y","A","AB","B","O","普","特"]
[null,null,null,null,43.5,"Y-４"]
[null,null,null,null,44,"Y-４"]
[null,null,null,null,44.5,"Y-４・Y-５"]
[null,null,null,null,45,"Y-５","A-５"]
[null,null,null,null,45.5,"Y-５・Y-６","A-５"]
[null,null,null,null,46,"Y-６","A-５"]
[null,null,null,null,46.5,"Y-６・Y-７","A-５・A-６","AB-５"]
[null,null,null,null,47,"Y-７","A-６","AB-５"]
[null,null,null,null,47.5,"Y-７・Y-８","A-６・A-７","AB-５"]
[null,null,null,null,48,"Y-８","A-７","AB-５・AB-６"]
[null,null,null,null,48.5,"Y-８・Y-９","A-７・A-８","AB-５・AB-６"]
[null,null,null,null,49,"Y-９","A-８","AB-６","B-５"]
[null,null,null,null,49.5,"Y-９・Y-１０","A-８・A-９","AB-６・AB-７","B-５"]
[null,null,null,null,50,"Y-１０","A-９","AB-７","B-５"]
[null,null,null,null,50.5,"Y-１０","A-９","AB-７・AB-８","B-５・B-６","O-５"]
[null,null,null,null,51,"Y-１０","A-９","AB-８","B-５・B-６","O-５"]
[null,null,null,null,51.5,null,null,"AB-８・AB-９","B-６","O-５"]
[null,null,null,null,52,null,null,"AB-９","B-６・B-７","O-５・O-６"]
[null,null,null,null,52.5,null,null,"AB-９・AB-１０","B-６・B-７","O-５・O-６"]
[null,null,null,null,53,null,null,"AB-１０","B-７","O-６"]
[null,null,null,null,53.5,null,null,"AB-１０","B-７・B-８","O-６"]
[null,null,null,null,54,null,null,"AB-１０","B-７・B-８","O-６"]
[null,null,null,null,54.5,null,null,null,"B-８"]
[null,null,null,null,55,null,null,null,"B-８"]
[null,null,null,null,55.5,null,null,null,"B-８"]
[null,null,null,null,56,null,null,null,null,null,null,"特"]

{"sheet":"サイズ表(身幅）","index":6,"n_rows":40,"n_cols":12,"rows_kept":40,"cut":false,"hidden":true,"merged":[]}
[]
[]
[]
[null,null,null,null,"身　幅"]
[]
[]
[null,null,null,null,"着丈・サイズ","Y","A","AB","B","O","普","特"]
[null,null,null,null,45.5,"Y-４"]
[null,null,null,null,46,"Y-４"]
[null,null,null,null,46.5,"Y-４・Y-５"]
[null,null,null,null,47,"Y-５","A-５"]
[null,null,null,null,47.5,"Y-５・Y-６","A-５"]
[null,null,null,null,48,"Y-６","A-５"]
[null,null,null,null,48.5,"Y-６・Y-７","A-５・A-６"]
[null,null,null,null,49,"Y-６・Y-７","A-５・A-６"]
[null,null,null,null,49.5,"Y-６・Y-７","A-５・A-６"]
[null,null,null,null,50,"Y-７","A-６"]
[null,null,null,null,50.5,"Y-７・Y-８","A-６・A-７"]
[null,null,null,null,51,"Y-７・Y-８","A-６・A-７","AB-５"]
[null,null,null,null,51.5,"Y-７・Y-８","A-６・A-７","AB-５"]
[null,null,null,null,52,"Y-８","A-７","AB-５"]
[null,null,null,null,52.5,"Y-８・Y-９","A-７・A-８","AB-５・AB-６"]
[null,null,null,null,53,"Y-８・Y-９","A-８","AB-５・AB-６","B-５"]
[null,null,null,null,53.5,"Y-８・Y-９","A-８・A-９","AB-５・AB-６","B-５"]
[null,null,null,null,54,"Y-９","A-８・A-９","AB-６","B-５"]
[null,null,null,null,54.5,"Y-９・Y-１０","A-８・A-９","AB-６・AB-７","B-５・B-６"]
[null,null,null,null,55,"Y-１０","A-９","AB-６・AB-７","B-５・B-６"]
[null,null,null,null,55.5,"Y-１０","A-９","AB-６・AB-７","B-５・B-６"]
[null,null,null,null,56,"Y-１０","A-９","AB-７","B-６"]
[null,null,null,null,56.5,null,null,"AB-７・AB-８","B-６・B-７"]
[null,null,null,null,57,null,null,"AB-７・AB-８","B-６・B-７"]
[null,null,null,null,57.5,null,null,"AB-７・AB-８","B-６・B-７"]
[null,null,null,null,58,null,null,"AB-８","B-７","O-５"]
[null,null,null,null,58.5,null,null,"AB-８・AB-９","B-７・B-８","O-５"]
[null,null,null,null,59,null,null,"AB-８・AB-９","B-７・B-８","O-５"]
[null,null,null,null,59.5,null,null,"AB-８・AB-９","B-７・B-８","O-５・O-６"]
[null,null,null,null,60,null,null,"AB-９","B-８","O-５・O-６",null,"特"]
[null,null,null,null,60.5,null,null,"AB-９・AB-１０","B-８","O-５・O-６"]
[null,null,null,null,61,null,null,"AB-１０","B-８","O-６"]
[null,null,null,null,61.5,null,null,"AB-１０",null,"O-６"]
{"$rows_left_out":1}
{"sheet":"サイズ表(袖丈）","index":7,"n_rows":30,"n_cols":12,"rows_kept":30,"cut":false,"hidden":true,"merged":[]}
[]
[]
[]
[null,null,null,null,"袖　丈"]
[]
[]
[null,null,null,null,"着丈・サイズ","Y","A","AB","B","O","普","特"]
[null,null,null,null,56,"Y-４"]
[null,null,null,null,56.5,"Y-４"]
[null,null,null,null,57,"Y-４・Y-５","A-５","AB-５","B-５","O-５"]
[null,null,null,null,57.5,"Y-４・Y-５","A-５","AB-５","B-５","O-５"]
[null,null,null,null,58,"Y-５","A-５","AB-５","B-５","O-５"]
[null,null,null,null,58.5,"Y-５・Y-６","A-５・A-６","AB-５","B-５・B-６","O-５・O-６"]
[null,null,null,null,59,"Y-５・Y-６","A-５・A-６","AB-６","B-５・B-６","O-５・O-６"]
[null,null,null,null,59.5,"Y-６","A-６","AB-６","B-６","O-６"]
[null,null,null,null,60,"Y-６・Y-７","A-６・A-７","AB-６","B-６・B-７","O-６"]
[null,null,null,null,60.5,"Y-６・Y-７","A-６・A-７","AB-７","B-６・B-７","O-６"]
[null,null,null,null,61,"Y-７","A-７","AB-７","B-７"]
[null,null,null,null,61.5,"Y-７・Y-８","A-７・A-８","AB-７","B-７・B-８"]
[null,null,null,null,62,"Y-７・Y-８","A-７・A-８","AB-８","B-７・B-８"]
[null,null,null,null,62.5,"Y-８","A-８","AB-８","B-８"]
[null,null,null,null,63,"Y-８・Y-９","A-８・A-９","AB-８","B-８"]
[null,null,null,null,63.5,"Y-８・Y-９","A-８・A-９","AB-９","B-８"]
[null,null,null,null,64,"Y-９","A-９","AB-９"]
[null,null,null,null,64.5,"Y-９・Y-１０","A-９","AB-９"]
[null,null,null,null,65,"Y-９・Y-１０","A-９","AB-１０"]
[null,null,null,null,65.5,"Y-１０",null,"AB-１０"]
[null,null,null,null,66,"Y-１０",null,"AB-１０"]
[null,null,null,null,66.5,"Y-１０",null,"AB-１０"]
[null,null,null,null,67,null,null,null,null,null,null,"特"]

{"sheet":"サイズ表(ウェスト）","index":8,"n_rows":38,"n_cols":12,"rows_kept":38,"cut":false,"hidden":true,"merged":[]}
[]
[]
[]
[null,null,null,null,"ウェスト"]
[]
[]
[null,null,null,null,"着丈・サイズ","Y","A","AB","B","O","普","特"]
[null,null,null,null,36.5,"Y-４"]
[null,null,null,null,37,"Y-４"]
[null,null,null,null,37.5,"Y-４・Y-５"]
[null,null,null,null,38,"Y-５"]
[null,null,null,null,38.5,"Y-５・Y-６"]
[null,null,null,null,39,"Y-６","A-５","AB-５"]
[null,null,null,null,39.5,"Y-６・Y-７","A-５","AB-５"]
[null,null,null,null,40,"Y-７","A-５","AB-５"]
[null,null,null,null,40.5,"Y-７・Y-８","A-５・A-６","AB-５・AB-６"]
[null,null,null,null,41,"Y-８","A-６","AB-６"]
[null,null,null,null,41.5,"Y-８・Y-９","A-６・A-７","AB-６・AB-７"]
[null,null,null,null,42,"Y-９","A-７","AB-７"]
[null,null,null,null,42.5,"Y-９・Y-１０","A-７・A-８","AB-７・AB-８"]
[null,null,null,null,43,"Y-１０","A-８","AB-８"]
[null,null,null,null,43.5,"Y-１０","A-８・A-９","AB-８・AB-９"]
[null,null,null,null,44,"Y-１０","A-９","AB-９"]
[null,null,null,null,44.5,null,"A-９","AB-９・AB-１０"]
[null,null,null,null,45,null,"A-９","AB-１０"]
[null,null,null,null,45.5,null,null,"AB-１０"]
[null,null,null,null,46,null,null,"AB-１０","B-５"]
[null,null,null,null,46.5,null,null,null,"B-５"]
[null,null,null,null,47,null,null,null,"B-５"]
[null,null,null,null,47.5,null,null,null,"B-５・B-６"]
[null,null,null,null,48,null,null,null,"B-６"]
[null,null,null,null,48.5,null,null,null,"B-６・B-７"]
[null,null,null,null,49,null,null,null,"B-７","O-５",null,"特"]
[null,null,null,null,49.5,null,null,null,"B-７・B-８","O-５"]
[null,null,null,null,50,null,null,null,"B-８","O-５"]
[null,null,null,null,50.5,null,null,null,"B-８","O-６・O-６"]
[null,null,null,null,51,null,null,null,"B-８","O-６"]
[null,null,null,null,51.5,null,null,null,null,"O-６"]

{"sheet":"サイズ表(総丈）","index":9,"n_rows":41,"n_cols":12,"rows_kept":41,"cut":false,"hidden":true,"merged":[]}
[]
[]
[]
[null,null,null,null,"総丈"]
[]
[]
[null,null,null,null,"着丈・サイズ","Y","A","AB","B","O","普","特"]
[null,null,null,null,95.5,"Y-４"]
[null,null,null,null,96,"Y-４","A-５"]
[null,null,null,null,96.5,"Y-４・Y-５","A-５"]
[null,null,null,null,97,"Y-４・Y-５","A-５","AB-５","B-５"]
[null,null,null,null,97.5,"Y-４・Y-５","A-５・A-６","AB-５","B-５"]
[null,null,null,null,98,"Y-５","A-５・A-６","AB-５","B-５","O-５"]
[null,null,null,null,98.5,"Y-５・Y-６","A-５・A-６","AB-５・AB-６","B-５","O-５"]
[null,null,null,null,99,"Y-５・Y-６","A-６","AB-５・AB-６","B-５・B-６","O-５"]
[null,null,null,null,99.5,"Y-５・Y-６","A-６","AB-５・AB-６","B-５・B-６","O-５・O-６"]
[null,null,null,null,100,"Y-６","A-６・A-７","AB-６","B-５・B-６","O-５・O-６"]
[null,null,null,null,100.5,"Y-６・Y-７","A-６・A-７","AB-６","B-６","O-５・O-６"]
[null,null,null,null,101,"Y-６・Y-７","A-６・A-７","AB-６","B-６","O-６"]
[null,null,null,null,101.5,"Y-６・Y-７","A-７","AB-６・AB-７","B-６","O-６"]
[null,null,null,null,102,"Y-７","A-７","AB-６・AB-７","B-６・B-７","O-６"]
[null,null,null,null,102.5,"Y-７","A-７・A-８","AB-６・AB-７","B-７","O-６"]
[null,null,null,null,103,"Y-７・Y-８","A-７・A-８","AB-７","B-７","O-６"]
[null,null,null,null,103.5,"Y-７・Y-８","A-７・A-８","AB-７","B-７"]
[null,null,null,null,104,"Y-７・Y-８","A-８","AB-７","B-７・B-８"]
[null,null,null,null,104.5,"Y-８","A-８・A-９","AB-７・AB-８","B-８"]
[null,null,null,null,105,"Y-８","A-８・A-９","AB-８","B-８"]
[null,null,null,null,105.5,"Y-８・Y-９","A-８・A-９","AB-８・AB-９","B-８"]
[null,null,null,null,106,"Y-８・Y-９","A-９","AB-８・AB-９","B-８"]
[null,null,null,null,106.5,"Y-８・Y-９","A-９","AB-８・AB-９"]
[null,null,null,null,107,"Y-９","A-９","AB-９"]
[null,null,null,null,107.5,"Y-９・Y-１０",null,"AB-９・AB-１０"]
[null,null,null,null,108,"Y-９・Y-１０",null,"AB-９・AB-１０"]
[null,null,null,null,108.5,"Y-９・Y-１０",null,"AB-９・AB-１０"]
[null,null,null,null,109,"Y-１０",null,"AB-１０"]
[null,null,null,null,109.5,"Y-１０",null,"AB-１０"]
[null,null,null,null,110,"Y-１０",null,"AB-１０"]
[null,null,null,null,110.5,null,null,"AB-１０"]
[null,null,null,null,111,null,null,"AB-１０"]
[null,null,null,null,111.5,null,null,"AB-１０"]
{"$rows_left_out":2}
{"sheet":"サイズ表(股下）","index":10,"n_rows":38,"n_cols":12,"rows_kept":38,"cut":false,"hidden":true,"merged":[]}
[]
[]
[]
[null,null,null,null,"股下"]
[]
[]
[null,null,null,null,"着丈・サイズ","Y","A","AB","B","O","普","特"]
[null,null,null,null,70.5,null,null,null,null,"O-５"]
[null,null,null,null,71,"Y-４",null,null,"B-５","O-５"]
[null,null,null,null,71.5,"Y-４",null,null,"B-５","O-５・O-６"]
[null,null,null,null,72,"Y-４","A-５","AB-５","B-５","O-５・O-６"]
[null,null,null,null,72.5,"Y-４・Y-５","A-５","AB-５","B-５・B-６","O-５・O-６"]
[null,null,null,null,73,"Y-４・Y-５","A-５","AB-５","B-５・B-６","O-６"]
[null,null,null,null,73.5,"Y-４・Y-５","A-５・A-６","AB-５・AB-６","B-５・B-６","O-６"]
[null,null,null,null,74,"Y-５","A-５・A-６","AB-５・AB-６","B-６","O-６"]
[null,null,null,null,74.5,"Y-５・Y-６","A-５・A-６","AB-５・AB-６","B-６・B-７"]
[null,null,null,null,75,"Y-５・Y-６","A-６","AB-６","B-６・B-７"]
[null,null,null,null,75.5,"Y-５・Y-６","A-６・A-７","AB-６・AB-７","B-６・B-７"]
[null,null,null,null,76,"Y-６","A-６・A-７","AB-６・AB-７","B-７"]
[null,null,null,null,76.5,"Y-６・Y-７","A-６・A-７","AB-６・AB-７","B-７"]
[null,null,null,null,77,"Y-６・Y-７","A-７","AB-７","B-７"]
[null,null,null,null,77.5,"Y-６・Y-７","A-７・A-８","AB-７・AB-８","B-７・B-８"]
[null,null,null,null,78,"Y-７","A-７・A-８","AB-７・AB-８","B-７・B-８"]
[null,null,null,null,78.5,"Y-７・Y-８","A-７・A-８","AB-７・AB-８","B-７・B-８"]
[null,null,null,null,79,"Y-７・Y-８","A-８","AB-８","B-８"]
[null,null,null,null,79.5,"Y-７・Y-８","A-８・A-９","AB-８・AB-９","B-８"]
[null,null,null,null,80,"Y-８","A-８・A-９","AB-８・AB-９","B-８"]
[null,null,null,null,80.5,"Y-８・Y-９","A-８・A-９","AB-８・AB-９","B-８"]
[null,null,null,null,81,"Y-８・Y-９","A-９","AB-９","B-８"]
[null,null,null,null,81.5,"Y-８・Y-９","A-９","AB-９・AB-１０"]
[null,null,null,null,82,"Y-９","A-９","AB-９・AB-１０"]
[null,null,null,null,82.5,"Y-８・Y-９",null,"AB-９・AB-１０"]
[null,null,null,null,83,"Y-８・Y-９",null,"AB-１０"]
[null,null,null,null,83.5,"Y-８・Y-９"]
[null,null,null,null,84,"Y-１０",null,"AB-１０"]
[null,null,null,null,84.5,"Y-１０",null,"AB-１０"]
[null,null,null,null,85,"Y-１０"]
[null,null,null,null,85.5,null,null,null,null,null,null,"特"]

{"sheet":"名前管理","index":11,"n_rows":10,"n_cols":13,"rows_kept":10,"cut":false,"hidden":true,"merged":[]}
[]
[]
[null,null,null,null,null,"色","ネクタイ","体形","Y","A","AB","B","O"]
[null,null,null,null,null,"紺色","A　特別タイプ(カフスボタン付き）","Y",4,5,5,5,5]
[null,null,null,null,null,"黒色","B　通常タイプ","A",5,6,6,6,6]
[null,null,null,null,null,"白色（白色の革靴付）",null,"AB",6,7,7,7]
[null,null,null,null,null,null,null,"B",7,8,8,8]
[null,null,null,null,null,null,null,"O",8,9,9]
[null,null,null,null,null,null,null,null,9,null,10]
[null,null,null,null,null,null,null,null,10]